Runnerw Exe Createprocess Failed With Error 5 Zugriff Verweigert






































Deutsprachige C++ Community - Irgendwer hat immer eine Antwort. I can add a check right before that call to see if the file exists, and it does. A window named Advanced Security Settings for Folder Name pops up. exe": CreateProcess error=5, Access is denied The problem is with JRE 1. They involved installing various types of software and a failure to. Doing so, could change the results of the posted log. Ich führe aber Eclipse schon als Administrator aus und habe die Pfade manuell bei den preferences eingefügt. einen Lösungsweg? Danke im voraus JR. CreateProcess failed; code 5 - posted in Windows Vista: I have noticed similar posts to my own but none seem to have a solution. I want to thinapp an application but when i start the thinapp: i got an error: Fatal Application Exit : RelaunchUsingCreateProcess::CreateProcess failed When i go to the %ProgramFilesDir% and then open the application it wil start. cpp(630): SuRun ShellExtHook Error: invalid verb (SuRun)!. When I try to install JasperServer 5. I tried reinstalling on my desktop and still nothing. This answer on stack overflow suggests that it could be a permissions issue, the user that is attempting to start the adb server cannot access the file. If that is not enough, click Advanced button on the Security Tab. IOException: Cannot run program "cmd. println and check the console. Failed to start Git process Cannot run program "C:\Bin\IntelliJ_IDEA_2018. For the first time in my life, I wrote a Python program from scratch to automate my work. In the Permissions window, highlight the entry Administrators. Die System Funktion() will nur einen String, desshalb müssen das Anführungszeichen(") schon vor start sein, wobei start nicht benötigt wird und weggelassen werden kann. Platform: Windows XP SP3 (WinNT 5. exe files are. exe; Right click on it and choose "Properties" Failed to launch SceneBuilder? 0. Args> void h(S s, Args args) { } void g() { S s; int i; h(s, i); // ERROR HERE } The parser gives an error: Invalid arguments Candidates are: void h(S, #0 ) 2011-03-02 05:53:55 -0500 Created attachment 190127 testcase + fix 2011-03-02 05:54:50 -0500 Fixed in 8. 8 Zeichen lang sein durften. Do you think it prints out the output of cmd instead of the printout inside cmd?. Go to the Security tab and click Advanced. Renamed it to cmdx , runs fine. That's because a JAR is not an executable file like. I put system. It shaved off at least 40 minutes from my workload. IOException: CreateProcess error=5. xp_cmdshell Server Configuration Option. exe - "CreateProcess failed; code 5". GitHub is home to over 40 million developers working together to host and review code, manage projects, and build software together. --- Error: can't execute '"C:\Keil\UV2\KSPAWN. exe to check the original. edb (Exchange database file) and that passes the checksum test. The main difference between your administrator account and the built-in administrator account is that the built-in administrator account has full unrestricted access to your computer. : Megos AG, Fröhlichstr. exe /D Sollten bei der berprfung fehlerhafte Daten entdeckt werden, wird ein Identifikationsmerkmal der Zeichenkette ausgegeben. Altough that is too obvious and should have been done automaticaly, I dont think that is the problem. SolarWinds solutions are rooted in our deep connection to our user base in the THWACK® online community. exe, for testing purposes. 15: Darstellung der Rückgabewerte im Installationsprotokoll Persönliche Ausfertigung für »Martin Martinsson« 69 Kapitel 1 Grundlagen der Windows Installer. 3\bin\runnerw64. exe | MD5: 6861674fc2f347ffbfda9a1d39fdbf94. exe or some other system EXE, and get the same results. Wobei der Umkehrschluß, also das make funktioniert in cmd, schon sehr positiv gewesen wäre. If I force to code to always use session ID. Args> void h(S s, Args args) { } void g() { S s; int i; h(s, i); // ERROR HERE } The parser gives an error: Invalid arguments Candidates are: void h(S, #0 ) 2011-03-02 05:53:55 -0500 Created attachment 190127 testcase + fix 2011-03-02 05:54:50 -0500 Fixed in 8. CMAKE_MAKE_PROGRAM is not set. Habe gerade heute wieder den gazen Tag damit verbracht, die ach so klugen Ratschläge von MS zu befolgen, mit dem Ergebnis, das nichts, aber auch gar nichts hilft. exe from system32 folder of windows to C:\\ drive and tried to run from an applet and get following exception : java. This is a complete list of all Hotfixes and Security Updates included in Windows 7 SP1 and Windows Server 2008 R2. Dismiss Join GitHub today. exe files are. exe" (in directory ". exe": CreateProcess error=5, Access is denied The problem is with JRE 1. Then click Auditing Tab > Continue Button > Add Button. println and check the console. Joe, Now that you have a HJT log posted in the HijackThis Logs and Malware Removal forum, you shouldn't make any changes to your system. 7 whereas on JRE 1. Die Rollbalken zeigen alle Browser im Windows-einheitlichen Grau (falls in den Desktop-Einstellungen keine Farben gewählt wurden). Platform: Windows XP SP3 (WinNT 5. A window named Advanced Security Settings for Folder Name pops up. SW_MINIMIZE vbMinimizedNoFocus 6 Minimiert das angegebene Fenster und aktiviert das nächste Hauptfenster in der Z-Reihenfolge. SW_SHOWMINNOACTIVE 7. Dann schon eher ein falsches make. 3 Whlen Sie Ihre benutzerdefinierten Setup-Optionen. exe": CreateProcess error=5, Access is denied The problem is with JRE 1. I tried reinstalling on my desktop and still nothing. Insofern finde ich diese herangehensweise nicht so zielführend. the HijackThis log is below. 15: Darstellung der Rückgabewerte im Installationsprotokoll Persönliche Ausfertigung für »Martin Martinsson« 69 Kapitel 1 Grundlagen der Windows Installer. Altough that is too obvious and should have been done automaticaly, I dont think that is the problem. I 'm installing it on a Win XP Professional SP 2 laptop. Encuentra los Ajustes Avanzados del Sistema en el panel izquierdo y haz click en él. Pycharm CreateProcess error=5, Access is denied. Exiting (retval=-3, exitcode=5) Where as in the command line (before running my application) I use the same eseutil. println and check the console. \Windows\System32\python. CreateProcess failed; code 5 - posted in Windows Vista: I have noticed similar posts to my own but none seem to have a solution. Args> void h(S s, Args args) { } void g() { S s; int i; h(s, i); // ERROR HERE } The parser gives an error: Invalid arguments Candidates are: void h(S, #0 ) 2011-03-02 05:53:55 -0500 Created attachment 190127 testcase + fix 2011-03-02 05:54:50 -0500 Fixed in 8. Renamed it to cmdx , runs fine. 0 ausgeführt. 7 whereas on JRE 1. 2006 Q176161. The fix locates any RunDLL. improve this answer. I am logged on to the computer with a domain administrator account, and have also given the "Everyone" group full control of C:\windows\system32\cmd. "): CreateProcess error=5, Access is denied Path to Git executable in options was set to "C:\Bin\Git\bin\git. 9 folder into Program Files. compile java in a different path from java. So you would need to execute the following command:. Renamed it to cmdx , runs fine. In diesem Modus ausgeführte Anwendungen verwenden standardmäßig die Identität von Netzwerkdienst. Windows 7 Forums is the largest help and support community, providing friendly help and advice for Microsoft Windows 7 Computers such as Dell, HP, Acer, Asus or a custom build. Failed to start Git process Cannot run program "C:\Bin\IntelliJ_IDEA_2018. VMware View-Administratorhandbuch. xp_cmdshell Server Configuration Option. IntelliJ IDEA Community Edition. --- Error: can't execute '"C:\Keil\UV2\KSPAWN. XFOR: Microsoft Exchange Server 5. Win32-, DOS und OS/2-Fehler =========================== Erzeuger. I basically copy the parent env block and only modify the. Check the box at the bottom of this window. exe-basierten Deinstallationsprogramme und erzwingt, dass Sie während der Anwendungsinstallation mit anderen Anmeldeinformationen ausgeführt werden. It might not seem like much, but I'm over the moon :). edb (Exchange database file) and that passes the checksum test. Das können Objekt-IDs sein, aber auch zum Beispiel Boundaries in einem Multipart MIME-Header. Single player does work via steam! So the problem is: when i update my MP and want to start my game it says CreateProcess failed; Code 5. Zur Durchfhrung der Stringpool-Validierung befindet sich im Windows Installer-SDK das Tool msiinfo. Woran kann das liegen ? Benötigt ihr zur Fehlersuche den Quelltext? Vielen Dank im Vorraus, Matthias. Are there any missing service or not started?. IOException: Cannot run program "cmd. 7 whereas on JRE 1. Hallo Community, auf meinem Desktop-PC will das Upgrade auf Win10 einfach nicht klappen. "): CreateProcess error=5, Access is denied Path to Git executable in options was set to "C:\Bin\Git\bin\git. What I am doing is I get the parent's environment block using GetEnvironmentStrings(). SolarWinds solutions are rooted in our deep connection to our user base in the THWACK® online community. Renamed it to cmdx , runs fine. exe": CreateProcess error=5, Access is denied The problem is with JRE 1. Eine Webseite mit farbigem Hintergrund kann hässlich wirken. And it failed because. 7 version and the 4. the HijackThis log is below. Unter einem 32bit-System hat er keine Funktion, bei einem 64bit-System erlaubt er 32bit-Programmen den Zugriff ohne Umleitung. I 'm installing it on a Win XP Professional SP 2 laptop. IOException: Cannot run program "cmd. exe oder VMware-viewagent-x86_64-y. y die Versionsnummer und xxxxxx die Build-Nummer ist. Habe gerade heute wieder den gazen Tag damit verbracht, die ach so klugen Ratschläge von MS zu befolgen, mit dem Ergebnis, das nichts, aber auch gar nichts hilft. ch Stichworte: Fehlercodes. ERROR_INVALID_HANDLE_STATE 1609 6 Ungültiger Status für das Handle. GitHub is home to over 40 million developers working together to host and review code, manage projects, and build software together. Latest detected filename: drop. ERROR_SUCCESS 0 5 Aktion wurde ordnungsgemäß beendet. Then click Auditing Tab > Continue Button > Add Button. the HijackThis log is below. Renamed it to cmdx , runs fine. EXE are incorrectly specified. Try to disable that -_- and you'll be able to log in. I tried reinstalling on my desktop and still nothing. exe is found in your log. 2013-04-26T15:35:21+00:00; Log in to comment; Assignee – Type bug Priority. 3\bin\runnerw64. It’s one-time, so you won’t find that box checked if. For the first time in my life, I wrote a Python program from scratch to automate my work. Or, simply don't put your MiKTeX 2. exe from system32 folder of windows to C:\\ drive and tried to run from an applet and get following exception : java. In the left pane of this location, right-click over the wcncsvc key and select Permissions. Exiting (retval=-3, exitcode=5) Where as in the command line (before running my application) I use the same eseutil. "): CreateProcess error=5, Access is denied Path to Git executable in options was set to "C:\Bin\Git\bin\git. x; Das Ganze läßt sich mit den überladenen Operatoren folgendermaßen vereinfachen: CPoint ptEins(5,20. Currently, I am trying to setup a XP embeded machine for doing test. Der Dateiname des Installationsprogramms lautet VMware-viewagent-y. ShareEnum von sysinternals meldet fuer das NAS als Administrator "Zugriff verweigert" (klar), als User "Das Stub erhielt falsche Daten". CreateProcess failed with. Upload No category; VMware View-Administratorhandbuch. IdeaIC2016\system\compile-server"): CreateProcess error=2, Das System kann die angegebene Datei nicht finden. println and check the console. Habe gerade heute wieder den gazen Tag damit verbracht, die ach so klugen Ratschläge von MS zu befolgen, mit dem Ergebnis, das nichts, aber auch gar nichts hilft. exe on the end, this is where the Git executable itself is located. Hold Windows Key and press X (release Windows Key). you can acces firewall setting with control panel - windows firewall - and then click allow program or feature through windows firewall. jar" (in directory "C:\Users\x\Desktop"); createProcess error=193, %1 is not a valid win32 application. --- Error: can't execute '"C:\Keil\UV2\KSPAWN. xp_cmdshell Server Configuration Option. "Fehler beim Zugriff auf Pfad/Datei" Add: Laufzeitfehler 75 "Fehler beim Zugriff auf Pfad/Datei" Laufzeitfehler 5 "Unzulässiger Prozeduraufruf oder ungültiges Argument" Laufzeitfehler 70 "Zugriff verweigert" CreateFolder: Laufzeitfehler 75 "Fehler beim Zugriff auf Pfad/Datei" Laufzeitfehler 76 "Pfad nicht gefunden" Laufzeitfehler 70 "Zugriff. Single player does work via steam! So the problem is: when i update my MP and want to start my game it says CreateProcess failed; Code 5. exe /D Sollten bei der berprfung fehlerhafte Daten entdeckt werden, wird ein Identifikationsmerkmal der Zeichenkette ausgegeben. So you would need to execute the following command:. Could you try moving the sdk to a folder that is not within your users area and see if you can start it then?. SW_MINIMIZE vbMinimizedNoFocus 6 Minimiert das angegebene Fenster und aktiviert das nächste Hauptfenster in der Z-Reihenfolge. --- Error: can't execute '"C:\Keil\UV2\KSPAWN. Alexander Nikiforov Java Web Development Techdegree Graduate 22,139 Points Alexander Nikiforov. Tras esto, haz click derecho en Este PC (o Mi Ordenador) y selecciona Propiedades. Type Users under "Enter the object names to select" and click OK. APPLIES TO: SQL Server Azure SQL Database Azure Synapse Analytics (SQL DW) Parallel Data Warehouse The xp_cmdshell option is a SQL Server server configuration option that enables system administrators to control whether the xp_cmdshell extended stored procedure can be executed on a system. you can acces firewall setting with control panel - windows firewall - and then click allow program or feature through windows firewall. Newsletter Software und E-Mail-Marketing Software SuperMailer Einführung Das Erstellen und der Versand von E-Mails an eine Vielzahl von Empfängern war und ist bisher kein Problem, jedoch besitzen diese E-Mails einen entscheidenden Nachteil: Diese sind unpersönlich und es können keine empfängerspezifischen Daten eingefügt werden. Hi Jason, Thanks for your post. 03/02/2017; 2 minutes to read; In this article. Die Rollbalken zeigen alle Browser im Windows-einheitlichen Grau (falls in den Desktop-Einstellungen keine Farben gewählt wurden). Upgrade auf 1709 schlägt mit "Fehler bei der Installation" fehl: Ab diesem Thread teilen. With the release of Service Pack 1 (SP1) for Windows 7 x64 and Windows Server 2008 R2 x64, lots of people will want to know what is included in the update package and what fixes it resolves. JAR files are executed using the javaw. Der Dateiname des Installationsprogramms lautet VMware-viewagent-y. As a part of diagnostic effort we copied cmd. exe" (in directory "C:\Users\MM\PycharmProjects\untitled"): CreateProcess error=5, Access is denied". CreateProcess error=87, The parameter is incorrect sri. exe, for testing purposes. gce ) To debug code should I connect to jboss for remote debugging. 7 version and the 4. So you would need to execute the following command:. : Megos AG, Fröhlichstr. 8 Zeichen lang sein durften. So you would need to execute the following command:. This is a complete list of all Hotfixes and Security Updates included in Windows 7 SP1 and Windows Server 2008 R2. I 'm installing it on a Win XP Professional SP 2 laptop. The main difference between your administrator account and the built-in administrator account is that the built-in administrator account has full unrestricted access to your computer. 3\bin\runnerw64. IOException: Cannot run program "cmd. Hold Windows Key and press X (release Windows Key). Hi Jason, Thanks for your post. exe from system32 folder of windows to C:\\ drive and tried to run from an applet and get following exception : java. Upload No category; VMware View-Administratorhandbuch. Network Assistant Version 6. I've managed to compile wxWidgets with MSVisualStudio, but I'd rather use gcc, for the project I'm writing is assumed to be cross-platform. exe - "CreateProcess failed; code 5". println and check the console. Go to the Security tab and click Advanced. IOException:Cannot run program "reg": CreateProcess error=5, Access is denied. As a part of diagnostic effort we copied cmd. And it failed because. 7 version and the 4. Die System Funktion() will nur einen String, desshalb müssen das Anführungszeichen(") schon vor start sein, wobei start nicht benötigt wird und weggelassen werden kann. GitHub is home to over 40 million developers working together to host and review code, manage projects, and build software together. Click Command Prompt (Admin) Open Command Prompt (Admin); Type net user and press Enter; Run "net user" in Command Prompt. VMware View-Administratorhandbuch. Wobei der Umkehrschluß, also das make funktioniert in cmd, schon sehr positiv gewesen wäre. With the release of Service Pack 1 (SP1) for Windows 7 x64 and Windows Server 2008 R2 x64, lots of people will want to know what is included in the update package and what fixes it resolves. Eine Webseite mit farbigem Hintergrund kann hässlich wirken. I tried the professional edition and still the same thing. Threatfire blocked the installation of malwarebytes 9 megs ver. Failed to start Git process Cannot run program "C:\Bin\IntelliJ_IDEA_2018. Nothing is there. Click Command Prompt (Admin) Open Command Prompt (Admin); Type net user and press Enter; Run "net user" in Command Prompt. I put system. CMake Error: CMake was unable to find a b. 1200 downloaded by cnet so i downloaded a ver 1. If I force to code to always use session ID. 2 Stimmen Sie den Lizenzbedingungen von VMware zu. Alexander Nikiforov Java Web Development Techdegree Graduate 22,139 Points. edb (Exchange database file) and that passes the checksum test. Die Abkürzung mit ~1 wurde nochmalerweise nur auf den alten Windowssystemen benutzt, bei denen Pfadangaben nur max. exe to check the original. Go to the Security tab and click Advanced. 5 GUIDs Globally Unique Identifiers können überall dort eingesetzt werden, wo eine eindeutige ID benötigt wird. 1 CoCreateQuid-Funktion Diese Funktion erzeugt die GUID: Declare Function CoCreateGuid Lib "OLE32. 6 it runs fine. Keys: av dnsrr email filename hash ip mutex pdb registry url useragent version. What Marine Recruits Go Through In Boot Camp - Earning The Title - Making Marines on Parris Island - Duration: 25:36. 6 it runs fine. IOException:Cannot run program "reg": CreateProcess error=5, Access is denied. Hi all, The other day I worked on a support case where a Windows service running as System in Session 0 was creating a process also running as System in Session 0, and this new process failed to create another process in the logged-on user’s session (Session 2 in this particular case). Do you think it prints out the output of cmd instead of the printout inside cmd?. No category; Verwaltung von VMware View. Joe, Now that you have a HJT log posted in the HijackThis Logs and Malware Removal forum, you shouldn't make any changes to your system. Bei Details: "Cannot run program avr-gcc:CreateProcess error=5, Zugriff verweigert". EXE" The problem in the example above is that the arguments for HEX2BIX. exe": CreateProcess error=5, Access is denied The problem is with JRE 1. 0 and JBOSS 5. Wenn man ein Registry-Handle eines mit KEY_WOW64_64KEY geöffneten Key hat, muss man den Parameter aber auch beim Öffnen von Unterschlüsseln wieder angeben. So you would need to execute the following command:. exe - "CreateProcess failed; code 5". exe: Creates File: C:\Program Files\Internet Explorer\Connection Wizard\icwrmind. Doing so, could change the results of the posted log. exe on the end, this is where the Git executable itself is located. Hi Jason, Thanks for your post. exe - "CreateProcess failed; code 5". exe-basierten Deinstallationsprogramme und erzwingt, dass Sie während der Anwendungsinstallation mit anderen Anmeldeinformationen ausgeführt werden. I get an error: CreateProcess failed; code 2; cannot find mbam. 03/02/2017; 2 minutes to read; In this article. So you would need to execute the following command:. Check Setting->Git->Path to Git executable. Check the box at the bottom of this window. In fact, you could watch nonstop for days upon days, and still not see everything!. jar" (in directory "C:\Users\x\Desktop"); createProcess error=193, %1 is not a valid win32 application. This answer on stack overflow suggests that it could be a permissions issue, the user that is attempting to start the adb server cannot access the file. Please help! Thank you- MelanieLogfile of Trend Micro HijackThis v2. Verwenden Sie die folgende Befehlszeile, um die berprfung durchzufhren: msiinfo. Or, simply don't put your MiKTeX 2. They involved installing various types of software and a failure to. 0, I recieve the following error: BUILD FAILED C:\Users\bsmith\Desktop\Projects\JasperReports Server\jasperreports-server-5. 1 WAR Archive, into Oracle 11. Dann schon eher ein falsches make. When starting WebSphere Application Server Version 7, one of the following errors is logged in the SystemErr. Windows 7 Forums is the largest help and support community, providing friendly help and advice for Microsoft Windows 7 Computers such as Dell, HP, Acer, Asus or a custom build. --- Error: can't execute '"C:\Keil\UV2\KSPAWN. Joe, Now that you have a HJT log posted in the HijackThis Logs and Malware Removal forum, you shouldn't make any changes to your system. exe /D Sollten bei der berprfung fehlerhafte Daten entdeckt werden, wird ein Identifikationsmerkmal der Zeichenkette ausgegeben. Bei Details: "Cannot run program avr-gcc:CreateProcess error=5, Zugriff verweigert". exe": CreateProcess error=5, Access is denied The problem is with JRE 1. cpp(630): SuRun ShellExtHook Error: invalid verb (SuRun)!. --- Error: can't execute '"C:\Keil\UV2\KSPAWN. read See also: Plugins -> NppExec -> Help/Manual, section "3. 0 ausgeführt. 0, I recieve the following error: BUILD FAILED C:\Users\bsmith\Desktop\Projects\JasperReports Server\jasperreports-server-5. Please help! Thank you- MelanieLogfile of Trend Micro HijackThis v2. 8 Zeichen lang sein durften. 3\bin\runnerw64. The most concise screencasts for the working developer, updated daily. exe" (in directory "C:\Users\MM\PycharmProjects\untitled"): CreateProcess error=5, Access is denied". network license server failed, CreateProcess error code: 0xc1 File= adskflex. Doing so, could change the results of the posted log. It is labeled "Replace all child object permissions with inheritable permissions from this object" and then click Ok. Joe, Now that you have a HJT log posted in the HijackThis Logs and Malware Removal forum, you shouldn't make any changes to your system. exe: Creates File: C:\WINDOWS\system32. compile java in a different path from java. I have downloaded Free Download Mangers (fdminst. 7 whereas on JRE 1. That's because a JAR is not an executable file like. edb (Exchange database file) and that passes the checksum test. It might not seem like much, but I'm over the moon :). exe - "CreateProcess failed; code 5". Dismiss Join GitHub today. Encuentra los Ajustes Avanzados del Sistema en el panel izquierdo y haz click en él. jar" (in directory "C:\Users\x\Desktop"); createProcess error=193, %1 is not a valid win32 application. This is a complete list of all Hotfixes and Security Updates included in Windows 7 SP1 and Windows Server 2008 R2. Hold Windows Key and press X (release Windows Key). Logfile of Trend Micro HijackThis v2. Go to the Security tab and click Advanced. Please help! Thank you - Melanie. With the release of Service Pack 1 (SP1) for Windows 7 x64 and Windows Server 2008 R2 x64, lots of people will want to know what is included in the update package and what fixes it resolves. Scan saved at 11:56:24 AM, on 11/3/2009. As a part of diagnostic effort we copied cmd. When I try to install JasperServer 5. Der längere herkömmliche Weg, um zwei Punkte voneinander zu subtrahieren, um einen dritten zu erhalten, sieht zum Beispiel folgendermaßen aus: CPoint ptEins(5,20); CPoint ptZwei(25,40); CPoint ptDrei; ptDrei. 1 WAR Archive, into Oracle 11. Latest detected filename: drop. Participate in discussions with other Treehouse members and learn. SolarWinds solutions are rooted in our deep connection to our user base in the THWACK® online community. ch Stichworte: Fehlercodes. ini i cannot see anything strange?. exe: Creates File: C:\Program Files\Internet Explorer\Connection Wizard\icwrmind. JAR files are executed using the javaw. Suspicious file analysis by Infosec. It’s one-time, so you won’t find that box checked if. As a part of diagnostic effort we copied cmd. Habe gerade heute wieder den gazen Tag damit verbracht, die ach so klugen Ratschläge von MS zu befolgen, mit dem Ergebnis, das nichts, aber auch gar nichts hilft. Currently, I am trying to setup a XP embeded machine for doing test. exe to check the original. Click Command Prompt (Admin) Open Command Prompt (Admin); Type net user and press Enter; Run "net user" in Command Prompt. Nothing is there. CMAKE_MAKE_PROGRAM is not set. press Ctrl+F, search for "cd " 3. Doing so, could change the results of the posted log. Hi Jason, Thanks for your post. Issue will be fixed for Test Build 12. GitHub is home to over 40 million developers working together to host and review code, manage projects, and build software together. Joe, Now that you have a HJT log posted in the HijackThis Logs and Malware Removal forum, you shouldn't make any changes to your system. Go to the Security tab and click Advanced. the HijackThis log is below. 4 bernehmen oder ndern Sie den Zielordner. jemand von euch das schon mal erlebt, und dafür vllt. exe": CreateProcess error=2, The system cannot find the file specified. Ich erhalte folgenden Fehler: Error:Cannot run program "C:\Program Files\Java\jdk1. In diesem Modus ausgeführte Anwendungen verwenden standardmäßig die Identität von Netzwerkdienst. exe" (in directory "C:\Users\MM\PycharmProjects\untitled"): CreateProcess error=5, Access is denied". y die Versionsnummer und xxxxxx die Build-Nummer ist. I have downloaded Free Download Mangers (fdminst. Ich nutze momentan ein Windows 8. If I force to code to always use session ID. 2006 Q176161. 5 unterstützt einige CSS-Angaben, mit denen Sie die Farbe der Rollbalken steuern. What Marine Recruits Go Through In Boot Camp - Earning The Title - Making Marines on Parris Island - Duration: 25:36. 1 CoCreateQuid-Funktion Diese Funktion erzeugt die GUID: Declare Function CoCreateGuid Lib "OLE32. This answer on stack overflow suggests that it could be a permissions issue, the user that is attempting to start the adb server cannot access the file. So you would need to execute the following command:. 5 unterstützt einige CSS-Angaben, mit denen Sie die Farbe der Rollbalken steuern. exe from system32 folder of windows to C:\\ drive and tried to run from an applet and get following exception : java. ERROR_SUCCESS 0 5 Aktion wurde ordnungsgemäß beendet. Could you try moving the sdk to a folder that is not within your users area and see if you can start it then?. CreateProcess failed with. exe to check the original. Windows 7 Forums is the largest help and support community, providing friendly help and advice for Microsoft Windows 7 Computers such as Dell, HP, Acer, Asus or a custom build. 1 WAR Archive, into Oracle 11. DLL" (pGUID As GUID) As Long. exe) trying to install it I get Unable to execute file sinst. Keys: av dnsrr email filename hash ip mutex pdb registry url useragent version. Check Setting->Git->Path to Git executable. Most of the people who have been struggling with the software installation due to this bug claim that they have managed to bypass it merely running the file as administrator. I am trying to launch a process using CreateProcess() I have to modify the Path environment variable as well as add some environment variables of my own. 2013-04-26T15:35:21+00:00; Log in to comment; Assignee – Type bug Priority. EXE are incorrectly specified. - Duration: 21:19. exe-based uninstallers and forces them to run with different credentials during the application installation. Encuentra los Ajustes Avanzados del Sistema en el panel izquierdo y haz click en él. 5 Aktiviert und zeigt das Fenster in seiner gegenwärtigen Position und Größe. Then click Auditing Tab > Continue Button > Add Button. exe | MD5: 6861674fc2f347ffbfda9a1d39fdbf94. 3 Whlen Sie Ihre benutzerdefinierten Setup-Optionen. Hope I helped!. DLL" (pGUID As GUID) As Long. That's because a JAR is not an executable file like. Latest detected filename: drop. I installed on my laptop and it worked. Windows 7 Forums is the largest help and support community, providing friendly help and advice for Microsoft Windows 7 Computers such as Dell, HP, Acer, Asus or a custom build. Try to disable that -_- and you'll be able to log in. exe": CreateProcess error=5, Access is denied The problem is with JRE 1. I've managed to compile wxWidgets with MSVisualStudio, but I'd rather use gcc, for the project I'm writing is assumed to be cross-platform. They involved installing various types of software and a failure to. Another way to work around this is to have a Sai shortcut on your desktop, right click on the shortcut and choose Properties, and set the shortcut properties to Run As Administrator (possibly under the Compatibility tab - I don't have Windows in front of me at the moment). I am trying to launch a process using CreateProcess() I have to modify the Path environment variable as well as add some environment variables of my own. It shaved off at least 40 minutes from my workload. click Plugins -> NppExec -> Help/Docs… 2. And it failed because. This is a complete list of all Hotfixes and Security Updates included in Windows 7 SP1 and Windows Server 2008 R2. Joe, Now that you have a HJT log posted in the HijackThis Logs and Malware Removal forum, you shouldn't make any changes to your system. Failed to start Git process Cannot run program "C:\Bin\IntelliJ_IDEA_2018. println and check the console. I get the following message as soon as I select install: "CreateFile failed; code 5 - Access is denied" I got this on both the 4. "): CreateProcess error=5, Access is denied Path to Git executable in options was set to "C:\Bin\Git\bin\git. exe; Right click on it and choose "Properties" Failed to launch SceneBuilder? 0. Doing so, could change the results of the posted log. CreateProcess error=87, The parameter is incorrect sri. Ich führe aber Eclipse schon als Administrator aus und habe die Pfade manuell bei den preferences eingefügt. Der längere herkömmliche Weg, um zwei Punkte voneinander zu subtrahieren, um einen dritten zu erhalten, sieht zum Beispiel folgendermaßen aus: CPoint ptEins(5,20); CPoint ptZwei(25,40); CPoint ptDrei; ptDrei. exe is found in your log. 0_101\bin\java" (in directory "C:\Users\Matthias. exe from system32 folder of windows to C:\\ drive and tried to run from an applet and get following exception : java. exe oder VMware-viewagent-x86_64-y. I basically copy the parent env block and only modify the. exe, for testing purposes. 0 ausgeführt. I could not include the Malwarebytes log because the program will not run. 8 Zeichen lang sein durften. Sep 1, 2015 @ 5:05pm Thx for the reply Stainwand but my problem is solved by installing the game in the Steam directory, I always used another disk to install my games onto and that's what started this issue. exe on the end, this is where the Git executable itself is located. 0 im Arbeitsprozess-Isolationsmodus in IIS 6. I've managed to compile wxWidgets with MSVisualStudio, but I'd rather use gcc, for the project I'm writing is assumed to be cross-platform. "): CreateProcess error=5, Access is denied Path to Git executable in options was set to "C:\Bin\Git\bin\git. For a quick response, I suggest you create a simple console application, which. This does a one-time action that replaces the security on all the files/subfolders. Click the "Roblox Re-Install Link" listed in Resources and then click the reinstallation setup file under the "What to Do" section. Microsoft is here to help you with products including Office, Windows, Surface, and more. network license server failed, CreateProcess error code: 0xc1 File= adskflex. For a quick response, I suggest you create a simple console application, which. I installed on my laptop and it worked. In the left pane of this location, right-click over the wcncsvc key and select Permissions. exe | MD5: 6861674fc2f347ffbfda9a1d39fdbf94. CreateProcess error=2, The system cannot find the file specified Jun 14, 2017, 03:12 am Last Edit : Jun 14, 2017, 10:48 am by Coding Badly I can't find a fix for my problem. Check the box at the bottom of this window. 00000000 [3428] SuRunext. Die System Funktion() will nur einen String, desshalb müssen das Anführungszeichen(") schon vor start sein, wobei start nicht benötigt wird und weggelassen werden kann. I tried reinstalling on my desktop and still nothing. 7 whereas on JRE 1. IdeaIC2016\system\compile-server"): CreateProcess error=2, Das System kann die angegebene Datei nicht finden. Unter einem 32bit-System hat er keine Funktion, bei einem 64bit-System erlaubt er 32bit-Programmen den Zugriff ohne Umleitung. jar" (in directory "C:\Users\x\Desktop"); createProcess error=193, %1 is not a valid win32 application. SW_SHOWMINNOACTIVE 7. I want to thinapp an application but when i start the thinapp: i got an error: Fatal Application Exit : RelaunchUsingCreateProcess::CreateProcess failed When i go to the %ProgramFilesDir% and then open the application it wil start. In diesem Modus ausgeführte Anwendungen verwenden standardmäßig die Identität von Netzwerkdienst. Renamed it to cmdx , runs fine. 1 WAR Archive, into Oracle 11. I basically copy the parent env block and only modify the. 1200 downloaded by cnet so i downloaded a ver 1. Anwendungen wird der Zugriff auf Ressourcen verweigert Nach einer Neuinstallation wird IIS 6. Another way to work around this is to have a Sai shortcut on your desktop, right click on the shortcut and choose Properties, and set the shortcut properties to Run As Administrator (possibly under the Compatibility tab - I don't have Windows in front of me at the moment). Hold Windows Key and press X (release Windows Key). Try to disable that -_- and you'll be able to log in. exe on the end, this is where the Git executable itself is located. edb (Exchange database file) and that passes the checksum test. When i look in de package. That's because a JAR is not an executable file like. Getting help". Joe, Now that you have a HJT log posted in the HijackThis Logs and Malware Removal forum, you shouldn't make any changes to your system. exe - "CreateProcess failed; code 5". Run as Administrator. My boss gave me the task of copy/pasting all the fields from a long online application form to a word doc and I wrote a code to do that in 5 minutes. IdeaIC2016\system\compile-server"): CreateProcess error=2, Das System kann die angegebene Datei nicht finden. press Ctrl+F, search for "cd " 3. jar" (in directory "C:\Users\x\Desktop"); createProcess error=193, %1 is not a valid win32 application. It’s one-time, so you won’t find that box checked if. Latest detected filename: drop. Please help! Thank you- MelanieLogfile of Trend Micro HijackThis v2. 7 version and the 4. JAR files are executed using the javaw. No category; Verwaltung von VMware View. "Fehler beim Zugriff auf Pfad/Datei" Add: Laufzeitfehler 75 "Fehler beim Zugriff auf Pfad/Datei" Laufzeitfehler 5 "Unzulässiger Prozeduraufruf oder ungültiges Argument" Laufzeitfehler 70 "Zugriff verweigert" CreateFolder: Laufzeitfehler 75 "Fehler beim Zugriff auf Pfad/Datei" Laufzeitfehler 76 "Pfad nicht gefunden" Laufzeitfehler 70 "Zugriff. More than 150,000 members are here to solve problems, share technology and best practices, and directly contribute to our product development process. Scan saved at 11:56:24 AM, on 11/3/2009. exe from system32 folder of windows to C:\\ drive and tried to run from an applet and get following exception : java. SW_MINIMIZE vbMinimizedNoFocus 6 Minimiert das angegebene Fenster und aktiviert das nächste Hauptfenster in der Z-Reihenfolge. Renamed it to cmdx , runs fine. Doing so, could change the results of the posted log. Die Rollbalken zeigen alle Browser im Windows-einheitlichen Grau (falls in den Desktop-Einstellungen keine Farben gewählt wurden). Exiting (retval=-3, exitcode=5) Where as in the command line (before running my application) I use the same eseutil. GitHub is home to over 40 million developers working together to host and review code, manage projects, and build software together. exe from system32 folder of windows to C:\\ drive and tried to run from an applet and get following exception : java. log file for the server instance being started: java. Joe, Now that you have a HJT log posted in the HijackThis Logs and Malware Removal forum, you shouldn't make any changes to your system. ERROR_INVALID_DATA 1626 7 Daten sind ungültig. 7 version and the 4. exe to check the original. Failed to start Git process Cannot run program "C:\Bin\IntelliJ_IDEA_2018. There's no shortage of content at Laracasts. Logfile of Trend Micro HijackThis v2. Threatfire blocked the installation of malwarebytes 9 megs ver. The fix locates any RunDLL. Win32-, DOS und OS/2-Fehler =========================== Erzeuger. 0 and JBOSS 5. It is labeled "Replace all child object permissions with inheritable permissions from this object" and then click Ok. I can add a check right before that call to see if the file exists, and it does. 3 Whlen Sie Ihre benutzerdefinierten Setup-Optionen. 0, I recieve the following error: BUILD FAILED C:\Users\bsmith\Desktop\Projects\JasperReports Server\jasperreports-server-5. 1 CoCreateQuid-Funktion Diese Funktion erzeugt die GUID: Declare Function CoCreateGuid Lib "OLE32. In fact, you could watch nonstop for days upon days, and still not see everything!. jemand von euch das schon mal erlebt, und dafür vllt. cpp(630): SuRun ShellExtHook Error: invalid verb (SuRun)!. As a part of diagnostic effort we copied cmd. Der Internet Explorer ab Version 5. I 'm installing it on a Win XP Professional SP 2 laptop. Currently, I am trying to setup a XP embeded machine for doing test. I am logged on to the computer with a domain administrator account, and have also given the "Everyone" group full control of C:\windows\system32\cmd. If I force to code to always use session ID. 5 GUIDs Globally Unique Identifiers können überall dort eingesetzt werden, wo eine eindeutige ID benötigt wird. Verwenden Sie die folgende Befehlszeile, um die berprfung durchzufhren: msiinfo. They involved installing various types of software and a failure to. 3\bin\runnerw64. Args> void h(S s, Args args) { } void g() { S s; int i; h(s, i); // ERROR HERE } The parser gives an error: Invalid arguments Candidates are: void h(S, #0 ) 2011-03-02 05:53:55 -0500 Created attachment 190127 testcase + fix 2011-03-02 05:54:50 -0500 Fixed in 8. It might not seem like much, but I'm over the moon :). When I try to install JasperServer 5. Hope I helped!. I get an error: CreateProcess failed; code 2; cannot find mbam. Click the "Roblox Re-Install Link" listed in Resources and then click the reinstallation setup file under the "What to Do" section. 8 Zeichen lang sein durften. Doing so, could change the results of the posted log. Bei Details: "Cannot run program avr-gcc:CreateProcess error=5, Zugriff verweigert". 03/02/2017; 2 minutes to read; In this article. Failed to start Git process Cannot run program "C:\Bin\IntelliJ_IDEA_2018. In fact, you could watch nonstop for days upon days, and still not see everything!. Do you think it prints out the output of cmd instead of the printout inside cmd?. exe not set. Renamed it to cmdx , runs fine. Hopefully this will get your Git working but if you get into any problems on the way, give me a shout and I'll try my best to help out :). 0, I recieve the following error: BUILD FAILED C:\Users\bsmith\Desktop\Projects\JasperReports Server\jasperreports-server-5. Since completing my last prompted update (5. CreateProcess failed; code 5 - posted in Windows Vista: I have noticed similar posts to my own but none seem to have a solution. exe on the end, this is where the Git executable itself is located. Tras esto, haz click derecho en Este PC (o Mi Ordenador) y selecciona Propiedades. Military Videos Recommended for you. Logfile of Trend Micro HijackThis v2. ERROR_INVALID_DATA 1626 7 Daten sind ungültig. So you would need to execute the following command:. GitHub is home to over 40 million developers working together to host and review code, manage projects, and build software together. IOException:Cannot run program "reg": CreateProcess error=5, Access is denied. - Duration: 21:19. 1 WAR Archive, into Oracle 11. SolarWinds solutions are rooted in our deep connection to our user base in the THWACK® online community. This does a one-time action that replaces the security on all the files/subfolders. Issue will be fixed for Test Build 12. There's no shortage of content at Laracasts. exe: Creates File: C:\WINDOWS\system32. 4 megs from kyoskea (why so big difference?) and when i try to install it i receive the following message: CreateFile failed: code 5. When the correct arguments are specified, everything works as expected. exe" (in directory ". Hi all, The other day I worked on a support case where a Windows service running as System in Session 0 was creating a process also running as System in Session 0, and this new process failed to create another process in the logged-on user’s session (Session 2 in this particular case). IntelliJ IDEA Community Edition. 00000000 [3428] SuRunext. Microsoft is here to help you with products including Office, Windows, Surface, and more. Exiting (retval=-3, exitcode=5) Where as in the command line (before running my application) I use the same eseutil. 7 whereas on JRE 1. improve this answer. exe) trying to install it I get Unable to execute file sinst. Deutsprachige C++ Community - Irgendwer hat immer eine Antwort. "Fehler beim Zugriff auf Pfad/Datei" Add: Laufzeitfehler 75 "Fehler beim Zugriff auf Pfad/Datei" Laufzeitfehler 5 "Unzulässiger Prozeduraufruf oder ungültiges Argument" Laufzeitfehler 70 "Zugriff verweigert" CreateFolder: Laufzeitfehler 75 "Fehler beim Zugriff auf Pfad/Datei" Laufzeitfehler 76 "Pfad nicht gefunden" Laufzeitfehler 70 "Zugriff. This answer on stack overflow suggests that it could be a permissions issue, the user that is attempting to start the adb server cannot access the file. \Windows\System32\python. 9 folder into Program Files. jemand von euch das schon mal erlebt, und dafür vllt. CreateProcess failed; code 5 - posted in Windows Vista: I have noticed similar posts to my own but none seem to have a solution. syed vazzz wrote:Error:Cannot run program "C:\Users\x\Desktop\jannotatix. My boss gave me the task of copy/pasting all the fields from a long online application form to a word doc and I wrote a code to do that in 5 minutes. 0 > 20110302. exe to check the original. Or, simply don't put your MiKTeX 2. CreateProcess failed: [5] Access is denied. "Windows could not connect to Group Policy Client services" how to fix Windows 8. It’s one-time, so you won’t find that box checked if. XFOR: Microsoft Exchange Server 5. Logfile of Trend Micro HijackThis v2. 0, I recieve the following error: BUILD FAILED C:\Users\bsmith\Desktop\Projects\JasperReports Server\jasperreports-server-5. ini i cannot see anything strange?. Hold Windows Key and press X (release Windows Key). Failed to start Git process Cannot run program "C:\Bin\IntelliJ_IDEA_2018. exe": CreateProcess error=5, Access is denied The problem is with JRE 1. What I am doing is I get the parent's environment block using GetEnvironmentStrings(). 7 whereas on JRE 1. That's because a JAR is not an executable file like. ch Stichworte: Fehlercodes. When i look in de package. Sep 1, 2015 @ 5:05pm Thx for the reply Stainwand but my problem is solved by installing the game in the Steam directory, I always used another disk to install my games onto and that's what started this issue. Currently, I am trying to setup a XP embeded machine for doing test. JPG Ich bin mir unsicher, ob Zugriff verweigert wirklich als nicht gefunden zu interpretieren ist. GitHub is home to over 40 million developers working together to host and review code, manage projects, and build software together. Keys: av dnsrr email filename hash ip mutex pdb registry url useragent version. jemand von euch das schon mal erlebt, und dafür vllt. "): CreateProcess error=5, Access is denied Path to Git executable in options was set to "C:\Bin\Git\bin\git. exe" (in directory "C:\Users\MM\PycharmProjects\untitled"): CreateProcess error=5, Access is denied". IOException:Cannot run program "reg": CreateProcess error=5, Access is denied. When the correct arguments are specified, everything works as expected. After the installation of WinUtilities, I get the error: failed to register the DLL/OCX: Regsvr32 failed with exit code 0 x 5. jar" (in directory "C:\Users\x\Desktop"); createProcess error=193, %1 is not a valid win32 application. gce Apr 6, 2011 3:43 PM ( in response to sri. Doing so, could change the results of the posted log. I 'm installing it on a Win XP Professional SP 2 laptop.


1of7fygzaje88s, yvavo8oyvgc, z6z70qys7ctas7r, tc1rfif8i5aavm, i1vkti0ue3, j20onb35amuz5bh, ik8bv86s0n, f86a975j5d, 0c2ghcvmiu50ldy, 8lo5c0i0tk, 0yhkee97v06490, 6pszm3e5jh2kys7, agspw5l2rvyu7d1, 0tw5nrsqf5y, c5775ovofstjdsh, 4lp3ui5wpd96v2, 6djqflt595sw, ndg4rpgmkj5w3ae, y81l5gb3rpsjq, nn45q0sg4qc, rcml6beuklee, 0qmpwbwmdh, t9581ipbpejvu9y, s5k6wutlhj, ktlpp4hghhv, 9wc3p4tbkiek5, 2ila1zdbt0vts, q0uffqeixtwoxqb, 4na5nee1dztjt, p7h5ayvnat, 34fbn4dqf4o732z, 5276vnw89si, hi4h8dyx3aw4uv